BDBM280390 US10030012, Example 20::ethyl 4-[4-(5- cyclopropyl- 1H-pyrazol-1- yl)piperidin-1- yl]azepane-1- carboxylate
SMILES CCOC(=O)N1CCCC(CC1)N1CCC(CC1)n1nccc1C1CC1
InChI Key InChIKey=OXWGLAQBYCUKSO-UHFFFAOYSA-N
Data  2 EC50
  Tab Delimited (TSV)   2D SDfile   Computed 3D by Vconf -m prep SDfile
Find this compound or compounds like it in BindingDB:
Activity Spreadsheet -- Enzyme Inhibition Constant Data from BindingDB
Found 1 hit for monomerid = 280390
TargetMuscarinic acetylcholine receptor M2(Homo sapiens (Human))
Heptares Therapeutics
US Patent
LigandPNGBDBM280390(US10030012, Example 20 | ethyl 4-[4-(5- cyclopropy...)
Affinity DataEC50:  2.26E+3nM
Ligand InfoPC cidPC sid
In DepthDetails US Patent